BDBM50330883 CHEMBL1233715::CHEMBL1277952::N1-((3R,4S)-4-((6-aminopyridin-2-yl)methyl)pyrrolidin-3-yl)-N2-(4-fluorobenzyl)ethane-1,2-diamine tetrahydrochloride::US9090589, 8
SMILES Cc1cc(N)nc(C[C@H]2CNC[C@@H]2NCCNCCc2cccc(F)c2)c1
InChI Key InChIKey=PUOKPLCASUFBAN-PXNSSMCTSA-N
Data  7 KI
PDB links: 2 PDB IDs match this monomer.
  Tab Delimited (TSV)   2D SDfile   Computed 3D by Vconf -m prep SDfile
Find this compound or compounds like it in BindingDB:
Activity Spreadsheet -- Enzyme Inhibition Constant Data from BindingDB
Found 7 hits for monomerid = 50330883
TargetNitric oxide synthase, brain(Homo sapiens (Human))
Northwestern University
US Patent
LigandPNGBDBM50330883(CHEMBL1233715 | CHEMBL1277952 | N1-((3R,4S)-4-((6-...)
Affinity DataKi:  17.7nM. Assay description: Recombinant NOS isozymes over-expressed in E. coli were utilized. (Ji, H., et al., Discovery of highly potent and selective inhibitors of neuronal ni...
TargetNitric oxide synthase, inducible(Mus musculus (mouse))
Northwestern University
Curated by ChEMBL
LigandPNGBDBM50330883(CHEMBL1233715 | CHEMBL1277952 | N1-((3R,4S)-4-((6-...)
Affinity DataKi:  19nM. Assay description: Inhibition of mouse recombinant iNOS
In DepthDetails ArticlePubMed
TargetNitric oxide synthase, inducible(Homo sapiens (Human))
Northwestern University
US Patent
LigandPNGBDBM50330883(CHEMBL1233715 | CHEMBL1277952 | N1-((3R,4S)-4-((6-...)
Affinity DataKi:  1.50E+4nM. Assay description: Recombinant NOS isozymes over-expressed in E. coli were utilized. (Ji, H., et al., Discovery of highly potent and selective inhibitors of neuronal ni...
In DepthDetails US Patent
TargetNitric oxide synthase, inducible(Mus musculus (mouse))
Northwestern University
Curated by ChEMBL
LigandPNGBDBM50330883(CHEMBL1233715 | CHEMBL1277952 | N1-((3R,4S)-4-((6-...)
Affinity DataKi:  1.89E+4nM. Assay description: Inhibition of mouse recombinant iNOS
In DepthDetails ArticlePubMed
TargetNitric oxide synthase, endothelial(Homo sapiens (Human))
Northwestern University
US Patent
LigandPNGBDBM50330883(CHEMBL1233715 | CHEMBL1277952 | N1-((3R,4S)-4-((6-...)
Affinity DataKi:  5.34E+4nM. Assay description: Recombinant NOS isozymes over-expressed in E. coli were utilized. (Ji, H., et al., Discovery of highly potent and selective inhibitors of neuronal ni...
TargetNitric oxide synthase, brain(Rattus norvegicus (rat))
Northwestern University
Curated by ChEMBL
LigandPNGBDBM50330883(CHEMBL1233715 | CHEMBL1277952 | N1-((3R,4S)-4-((6-...)
Affinity DataKi:  1.61E+7nM. Assay description: Inhibition of rat recombinant nNOS
TargetNitric oxide synthase, endothelial(Bos taurus (bovine))
Northwestern University
Curated by ChEMBL
LigandPNGBDBM50330883(CHEMBL1233715 | CHEMBL1277952 | N1-((3R,4S)-4-((6-...)
Affinity DataKi:  5.71E+7nM. Assay description: Inhibition of bovine recombinant eNOS