BDBM50331744 (S)-1-(2-amino-2-carboxyethyl)-1H-1,2,3-triazole-4-carboxylic acid::CHEMBL1288410
SMILES N[C@@H](Cn1cc(nn1)C(O)=O)C(O)=O
InChI Key InChIKey=FOAQSAOIBZTITH-VKHMYHEASA-N
Data  2 EC50
  Tab Delimited (TSV)   2D SDfile   Computed 3D by Vconf -m prep SDfile
Find this compound or compounds like it in BindingDB:
Activity Spreadsheet -- Enzyme Inhibition Constant Data from BindingDB
Found 2 hits for monomerid = 50331744
TargetMetabotropic glutamate receptor 4(Homo sapiens (Human))
The University Of Adelaide
Curated by ChEMBL
LigandPNGBDBM50331744((S)-1-(2-amino-2-carboxyethyl)-1H-1,2,3-triazole-4...)
Affinity DataEC50: >1.00E+5nM. Assay description: Binding affinity at mGluR4 expressed in CHO cells assessed as inhibition of forskolin-stimulated cAMP production after 10 mins
In DepthDetails ArticlePubMed
TargetMetabotropic glutamate receptor 2(Homo sapiens (Human))
The University Of Adelaide
Curated by ChEMBL
LigandPNGBDBM50331744((S)-1-(2-amino-2-carboxyethyl)-1H-1,2,3-triazole-4...)
Affinity DataEC50: >1.00E+5nM. Assay description: Binding affinity at mGluR2 expressed in CHO cells assessed as inhibition of forskolin-stimulated cAMP production after 10 mins
In DepthDetails ArticlePubMed