BDBM50331795 1,1,1-trifluoro-2-(1-((2-(2-hydroxypropan-2-yl)-3-phenylbenzo[b]thiophen-6-yl)methyl)-1H-1,2,3-triazol-4-yl)butan-2-ol::CHEMBL1289094
SMILES CCC(O)(c1cn(Cc2ccc3c(c(sc3c2)C(C)(C)O)-c2ccccc2)nn1)C(F)(F)F
InChI Key InChIKey=FUWQAKNTNMMDBM-UHFFFAOYSA-N
Data  1 KI  2 IC50
  Tab Delimited (TSV)   2D SDfile   Computed 3D by Vconf -m prep SDfile
Find this compound or compounds like it in BindingDB:
Activity Spreadsheet -- Enzyme Inhibition Constant Data from BindingDB
Found 3 hits for monomerid = 50331795
TargetPotassium voltage-gated channel subfamily H member 2(Homo sapiens (Human))
Merck Frosst Centre For Therapeutic Research
Curated by ChEMBL
LigandPNGBDBM50331795(1,1,1-trifluoro-2-(1-((2-(2-hydroxypropan-2-yl)-3-...)
Affinity DataKi:  2.60E+3nM. Assay description: Displacement of labeled MK-499 from human ERG
In DepthDetails ArticlePubMed
TargetPolyunsaturated fatty acid 5-lipoxygenase(Homo sapiens (Human))
Merck Frosst Centre For Therapeutic Research
Curated by ChEMBL
LigandPNGBDBM50331795(1,1,1-trifluoro-2-(1-((2-(2-hydroxypropan-2-yl)-3-...)
Affinity DataIC50:  392nM. Assay description: Inhibition of 5-lipoxygenase in human whole blood assessed as inhibition of LTB4 production
In DepthDetails ArticlePubMed
TargetPolyunsaturated fatty acid 5-lipoxygenase(Homo sapiens (Human))
Merck Frosst Centre For Therapeutic Research
Curated by ChEMBL
LigandPNGBDBM50331795(1,1,1-trifluoro-2-(1-((2-(2-hydroxypropan-2-yl)-3-...)
Affinity DataIC50:  198nM. Assay description: Inhibition of human recombinant 5-lipoxygenase assessed as arachidonic acid oxidation
In DepthDetails ArticlePubMed