BDBM50331850 4-oxo-4-(5-(trifluoromethyl)-1,3,4-thiadiazol-2-yl)butanoic acid::CHEMBL1288963
SMILES OC(=O)CCC(=O)c1nnc(s1)C(F)(F)F
InChI Key InChIKey=VVVFOQXWTSSZSR-UHFFFAOYSA-N
Data  1 IC50
  Tab Delimited (TSV)   2D SDfile   Computed 3D by Vconf -m prep SDfile
Find this compound or compounds like it in BindingDB:
Activity Spreadsheet -- Enzyme Inhibition Constant Data from BindingDB
Found 1 hit for monomerid = 50331850
TargetEndochitinase A1(Neosartorya fumigata (Aspergillus fumigatus))
University Of Dundee
Curated by ChEMBL
LigandPNGBDBM50331850(4-oxo-4-(5-(trifluoromethyl)-1,3,4-thiadiazol-2-yl...)
Affinity DataIC50: >1.00E+6nM. Assay description: Inhibition of Aspergillus fumigatus ChiA1 expressed in Pichia pastoris after 70 mins
In DepthDetails ArticlePubMed