BDBM50331897 CHEMBL1289107::E-5-Fluoro-3-[[4-(methylsulfonyl)phenyl]methylene]-indolin-2-one
SMILES CS(=O)(=O)c1ccc(\C=C2\C(=O)Nc3ccc(F)cc23)cc1
InChI Key InChIKey=CCFTYTAWQLACEE-RIYZIHGNSA-N
Data  2 IC50
  Tab Delimited (TSV)   2D SDfile   Computed 3D by Vconf -m prep SDfile
Find this compound or compounds like it in BindingDB:
Activity Spreadsheet -- Enzyme Inhibition Constant Data from BindingDB
Found 2 hits for monomerid = 50331897
TargetProstaglandin G/H synthase 2(Oryctolagus cuniculus)
China Pharmaceutical University
Curated by ChEMBL
LigandPNGBDBM50331897(CHEMBL1289107 | E-5-Fluoro-3-[[4-(methylsulfonyl)p...)
Affinity DataIC50: >5.00E+4nM. Assay description: Inhibition of COX-2 in rabbit peripheral venous blood assessed as formation of 12-hydroxyheptadecatrienoic acid after 24 hrs in by HPLC presence of c...
In DepthDetails ArticlePubMed
TargetProstaglandin G/H synthase 1(Oryctolagus cuniculus)
China Pharmaceutical University
Curated by ChEMBL
LigandPNGBDBM50331897(CHEMBL1289107 | E-5-Fluoro-3-[[4-(methylsulfonyl)p...)
Affinity DataIC50:  8.99E+3nM. Assay description: Inhibition of COX-1 in rabbit peripheral venous blood assessed as formation of 12-hydroxyheptadecatrienoic acid after 24 hrs by HPLC in presence of c...
In DepthDetails ArticlePubMed