BDBM50332123 (S)-2-(4-chlorophenyl)-4-(pyrrolidin-2-ylmethylamino)thieno[3,2-c]pyridine-7-carboxamide::CHEMBL1288219
SMILES NC(=O)c1cnc(NC[C@@H]2CCCN2)c2cc(sc12)-c1ccc(Cl)cc1
InChI Key InChIKey=DCMSFYRENMMFPF-ZDUSSCGKSA-N
Data  1 IC50
  Tab Delimited (TSV)   2D SDfile   Computed 3D by Vconf -m prep SDfile
Find this compound or compounds like it in BindingDB:
Activity Spreadsheet -- Enzyme Inhibition Constant Data from BindingDB
Found 1 hit for monomerid = 50332123
TargetSerine/threonine-protein kinase Chk1(Homo sapiens (Human))
Merck Research Laboratories
Curated by ChEMBL
LigandPNGBDBM50332123((S)-2-(4-chlorophenyl)-4-(pyrrolidin-2-ylmethylami...)
Affinity DataIC50:  197nM. Assay description: Inhibition of His-tagged CHK1 after 2 hrs by liquid scintillation counting
In DepthDetails ArticlePubMed