BDBM50332133 (S)-4-(piperidin-3-ylamino)-2-(pyridin-4-yl)thieno[3,2-c]pyridine-7-carboxamide::CHEMBL1287891
SMILES NC(=O)c1cnc(N[C@H]2CCCNC2)c2cc(sc12)-c1ccncc1
InChI Key InChIKey=BFNCPOVPMNPESI-LBPRGKRZSA-N
Data  1 IC50
  Tab Delimited (TSV)   2D SDfile   Computed 3D by Vconf -m prep SDfile
Find this compound or compounds like it in BindingDB:
Activity Spreadsheet -- Enzyme Inhibition Constant Data from BindingDB
Found 1 hit for monomerid = 50332133
TargetSerine/threonine-protein kinase Chk1(Homo sapiens (Human))
Merck Research Laboratories
Curated by ChEMBL
LigandPNGBDBM50332133((S)-4-(piperidin-3-ylamino)-2-(pyridin-4-yl)thieno...)
Affinity DataIC50:  3nM. Assay description: Inhibition of His-tagged CHK1 after 2 hrs by liquid scintillation counting
In DepthDetails ArticlePubMed