BDBM50332362 (5-(methylsulfonyl)-2-((S)-1,1,1-trifluoropropan-2-yloxy)phenyl)(5-(tetrahydro-2H-pyran-2-yl)isoindolin-2-yl)methanone::CHEMBL1631022
SMILES C[C@H](Oc1ccc(cc1C(=O)N1Cc2ccc(cc2C1)C1CCCCO1)S(C)(=O)=O)C(F)(F)F
InChI Key InChIKey=NDZBXHIFLMZLMT-ZDGMYTEDSA-N
Data  2 EC50
  Tab Delimited (TSV)   2D SDfile   Computed 3D by Vconf -m prep SDfile
Find this compound or compounds like it in BindingDB:
Activity Spreadsheet -- Enzyme Inhibition Constant Data from BindingDB
Found 2 hits for monomerid = 50332362
TargetSodium- and chloride-dependent glycine transporter 2(Homo sapiens (Human))
F. Hoffmann-La Roche
Curated by ChEMBL
LigandPNGBDBM50332362((5-(methylsulfonyl)-2-((S)-1,1,1-trifluoropropan-2...)
Affinity DataEC50: >3.00E+4nM. Assay description: Inhibition of human GlyT2 expressed in CHO cells assessed as inhibition of [3H]glycine uptake by liquid scintillation counting
In DepthDetails ArticlePubMed
TargetSodium- and chloride-dependent glycine transporter 1(Homo sapiens (Human))
F. Hoffmann-La Roche
Curated by ChEMBL
LigandPNGBDBM50332362((5-(methylsulfonyl)-2-((S)-1,1,1-trifluoropropan-2...)
Affinity DataEC50:  205nM. Assay description: Inhibition of human GlyT1 expressed in CHO cells assessed as inhibition of [3H]glycine uptake by liquid scintillation counting
In DepthDetails ArticlePubMed