BDBM50332453 8-(4-tert-butylbenzoyl)-3-(2-(4-(2-hydroxyethyl)piperidin-1-yl)-2-oxoethyl)-1-phenyl-1,3,8-triazaspiro[4.5]decan-4-one::CHEMBL1632077
SMILES CC(C)(C)c1ccc(cc1)C(=O)N1CCC2(CC1)N(CN(CC(=O)N1CCC(CCO)CC1)C2=O)c1ccccc1
InChI Key InChIKey=DKZGWIZRRMCVOY-UHFFFAOYSA-N
Data  1 IC50
  Tab Delimited (TSV)   2D SDfile   Computed 3D by Vconf -m prep SDfile
Find this compound or compounds like it in BindingDB:
Activity Spreadsheet -- Enzyme Inhibition Constant Data from BindingDB
Found 1 hit for monomerid = 50332453
TargetNPC1-like intracellular cholesterol transporter 1(Homo sapiens (Human))
Merck
Curated by ChEMBL
LigandPNGBDBM50332453(8-(4-tert-butylbenzoyl)-3-(2-(4-(2-hydroxyethyl)pi...)
Affinity DataIC50:  2.60E+3nM. Assay description: Displacement of [35S](2S,3S,4S,5R,6S)-6-(4-((2S,3R)-3-((S)-3-(4-fluorophenyl)-3-hydroxypropyl)-1-(4-(3-(methylsulfonamido)prop-1-ynyl)phenyl)-4-oxoaz...
In DepthDetails ArticlePubMed