BDBM50332576 CHEMBL1630727::N-(2-(5-fluoro-1H-indol-3-yl)ethyl)propan-1-amine
SMILES CCCNCCc1c[nH]c2ccc(F)cc12
InChI Key InChIKey=PMEDGACUJJCVSG-UHFFFAOYSA-N
Data  2 IC50
  Tab Delimited (TSV)   2D SDfile   Computed 3D by Vconf -m prep SDfile
Find this compound or compounds like it in BindingDB:
Activity Spreadsheet -- Enzyme Inhibition Constant Data from BindingDB
Found 2 hits for monomerid = 50332576
TargetMyeloperoxidase(Homo sapiens (Human))
Universite£? Libre De Bruxelles
Curated by ChEMBL
LigandPNGBDBM50332576(CHEMBL1630727 | N-(2-(5-fluoro-1H-indol-3-yl)ethyl...)
Affinity DataIC50:  460nM. Assay description: Inhibition of recombinant MPO mediated LDL oxidation using MPO/Cl-/H2O2 system
In DepthDetails ArticlePubMed
TargetMyeloperoxidase(Homo sapiens (Human))
Universite£? Libre De Bruxelles
Curated by ChEMBL
LigandPNGBDBM50332576(CHEMBL1630727 | N-(2-(5-fluoro-1H-indol-3-yl)ethyl...)
Affinity DataIC50:  800nM. Assay description: Inhibition of recombinant MPO mediated taurine chlorination by microplate reader method
In DepthDetails ArticlePubMed