BDBM50332580 5-fluoro-3-(2-(pyrrolidin-1-yl)ethyl)-1H-indole::CHEMBL1630731
SMILES Fc1ccc2[nH]cc(CCN3CCCC3)c2c1
InChI Key InChIKey=ORCITSDDHKMOSI-UHFFFAOYSA-N
Data  2 IC50
  Tab Delimited (TSV)   2D SDfile   Computed 3D by Vconf -m prep SDfile
Find this compound or compounds like it in BindingDB:
Activity Spreadsheet -- Enzyme Inhibition Constant Data from BindingDB
Found 2 hits for monomerid = 50332580
TargetMyeloperoxidase(Homo sapiens (Human))
Universite£? Libre De Bruxelles
Curated by ChEMBL
LigandPNGBDBM50332580(5-fluoro-3-(2-(pyrrolidin-1-yl)ethyl)-1H-indole | ...)
Affinity DataIC50:  1.03E+3nM. Assay description: Inhibition of recombinant MPO mediated LDL oxidation using MPO/Cl-/H2O2 system
In DepthDetails ArticlePubMed
TargetMyeloperoxidase(Homo sapiens (Human))
Universite£? Libre De Bruxelles
Curated by ChEMBL
LigandPNGBDBM50332580(5-fluoro-3-(2-(pyrrolidin-1-yl)ethyl)-1H-indole | ...)
Affinity DataIC50:  40nM. Assay description: Inhibition of recombinant MPO mediated taurine chlorination by microplate reader method
In DepthDetails ArticlePubMed