BDBM50332634 CHEMBL1630807::N-(4-Methoxyphenyl)-7-oxo-7,7a-dihydrocyclopropa[b]chromene-1a(1H)-carboxamide
SMILES COc1ccc(NC(=O)C23CC2C(N=O)c2ccccc2O3)cc1
InChI Key InChIKey=PPETWINIGCTIHV-UHFFFAOYSA-N
Data  1 KI  1 IC50  1 EC50
  Tab Delimited (TSV)   2D SDfile   Computed 3D by Vconf -m prep SDfile
Find this compound or compounds like it in BindingDB:
Activity Spreadsheet -- Enzyme Inhibition Constant Data from BindingDB
Found 3 hits for monomerid = 50332634
TargetMetabotropic glutamate receptor 2(Homo sapiens (Human))
Domain Therapeutics
Curated by ChEMBL
LigandPNGBDBM50332634(CHEMBL1630807 | N-(4-Methoxyphenyl)-7-oxo-7,7a-dih...)
Affinity DataKi:  800nM. Assay description: Binding affinity to GFP tagged human mGluR2 containing truncated N-terminal region expressed in HEK cells by FRET assay
In DepthDetails ArticlePubMed
TargetMetabotropic glutamate receptor 3(Homo sapiens (Human))
Domain Therapeutics
Curated by ChEMBL
LigandPNGBDBM50332634(CHEMBL1630807 | N-(4-Methoxyphenyl)-7-oxo-7,7a-dih...)
Affinity DataEC50:  1.04E+4nM. Assay description: Positive allosteric modulator activity at human mGluR3 expressed in HEK cells in presence of glutamate EC10 concentration by Ca2+ functional assay
In DepthDetails ArticlePubMed
TargetMetabotropic glutamate receptor 2(Homo sapiens (Human))
Domain Therapeutics
Curated by ChEMBL
LigandPNGBDBM50332634(CHEMBL1630807 | N-(4-Methoxyphenyl)-7-oxo-7,7a-dih...)
Affinity DataIC50:  1.00E+3nM. Assay description: Negative allosteric modulator activity at human mGluR2 expressed in HEK cells in presence of glutamate EC80 concentration by Ca2+ functional assay
In DepthDetails ArticlePubMed