BDBM50333307 CHEMBL1645291::N1-(4-chloro-3-fluorophenyl)-N2-(2-(morpholinomethyl)benzyl)oxalamide
SMILES Fc1cc(NC(=O)C(=O)NCc2ccccc2CN2CCOCC2)ccc1Cl
InChI Key InChIKey=IOLDNANRDDANCD-UHFFFAOYSA-N
Data  1 IC50
  Tab Delimited (TSV)   2D SDfile   Computed 3D by Vconf -m prep SDfile
Find this compound or compounds like it in BindingDB:
Activity Spreadsheet -- Enzyme Inhibition Constant Data from BindingDB
Found 1 hit for monomerid = 50333307
TargetEnvelope glycoprotein gp160(Human immunodeficiency virus type 1 group M subtyp...)
Bryn Mawr College
Curated by ChEMBL
LigandPNGBDBM50333307(CHEMBL1645291 | N1-(4-chloro-3-fluorophenyl)-N2-(2...)
Affinity DataIC50:  2.05E+4nM. Assay description: Inhibition of HIV1 YU2 gp120 binding to CD4 expressing Cf2Th-CD4/CCR5 cells assessed as inhibition of viral infection after 48 hrs
In DepthDetails ArticlePubMed