BDBM50333574 2-[5-Chloro-2-(9-ethyl-6,7,8,9-tetrahydro-5-oxa-9-aza-benzocyclohepten-2-ylamino)-pyrimidin-4-ylamino]-3-fluoro-N-methyl-benzamide::CHEMBL1642148
SMILES CCN1CCCOc2ccc(Nc3ncc(Cl)c(Nc4c(F)cccc4C(=O)NC)n3)cc12
InChI Key InChIKey=QMDSNSHMWIVCND-UHFFFAOYSA-N
Data  3 IC50
  Tab Delimited (TSV)   2D SDfile   Computed 3D by Vconf -m prep SDfile
Find this compound or compounds like it in BindingDB:
Activity Spreadsheet -- Enzyme Inhibition Constant Data from BindingDB
Found 3 hits for monomerid = 50333574
TargetInsulin receptor(Homo sapiens (Human))
Cephalon
Curated by ChEMBL
LigandPNGBDBM50333574(2-[5-Chloro-2-(9-ethyl-6,7,8,9-tetrahydro-5-oxa-9-...)
Affinity DataIC50:  490nM. Assay description: Inhibition of insulin receptor after 1 hr
In DepthDetails ArticlePubMed
TargetHepatocyte growth factor receptor(Homo sapiens (Human))
Cephalon
Curated by ChEMBL
LigandPNGBDBM50333574(2-[5-Chloro-2-(9-ethyl-6,7,8,9-tetrahydro-5-oxa-9-...)
Affinity DataIC50:  120nM. Assay description: Inhibition of c-Met cytoplasmic domain expressed in baculovirus after 30 mins by time-resolved fluorescence assay
In DepthDetails ArticlePubMed
TargetHepatocyte growth factor receptor(Homo sapiens (Human))
Cephalon
Curated by ChEMBL
LigandPNGBDBM50333574(2-[5-Chloro-2-(9-ethyl-6,7,8,9-tetrahydro-5-oxa-9-...)
Affinity DataIC50:  41nM. Assay description: Inhibition of c-Met expressed in human GTL-16 cells after 2 hrs
In DepthDetails ArticlePubMed