BDBM50333611 4-(Benzyloxy)-1-(4-{[2-(diethylamino)ethyl](methyl)-amino}phenyl)pyridin-2(1H)-one::CHEMBL1642493
SMILES CCN(CC)CCN(C)c1ccc(cc1)-n1ccc(OCc2ccccc2)cc1=O
InChI Key InChIKey=YZYWRIRBKREDKI-UHFFFAOYSA-N
Data  2 IC50
  Tab Delimited (TSV)   2D SDfile   Computed 3D by Vconf -m prep SDfile
Find this compound or compounds like it in BindingDB:
Activity Spreadsheet -- Enzyme Inhibition Constant Data from BindingDB
Found 2 hits for monomerid = 50333611
TargetPotassium voltage-gated channel subfamily H member 2(Homo sapiens (Human))
Tsukuba Research Institute
Curated by ChEMBL
LigandPNGBDBM50333611(4-(Benzyloxy)-1-(4-{[2-(diethylamino)ethyl](methyl...)
Affinity DataIC50:  1.70nM. Assay description: Displacement of [35S]N-[(4R)-10-[(2R)-6-cyano-1,2,3,4-tetrahydro-2-naphthyl]-3,4-dihydro-4-hydroxyspiro[2H-1-benzopyran-2,40-piperidin]-6-yl]methanes...
In DepthDetails ArticlePubMed
TargetMelanin-concentrating hormone receptor 1(Homo sapiens (Human))
Tsukuba Research Institute
Curated by ChEMBL
LigandPNGBDBM50333611(4-(Benzyloxy)-1-(4-{[2-(diethylamino)ethyl](methyl...)
Affinity DataIC50:  16nM. Assay description: Displacement of [125I]MCH from human MCHR1 expressed in CHO cells by competition binding assay
In DepthDetails ArticlePubMed