BDBM50333622 1-((2S,3S,4R,5R,6S)-6-(4-chloro-3-((5-(furan-2-yl)thiazol-2-yl)methyl)phenyl)-3,4,5-trihydroxytetrahydro-2H-pyran-2-yl)propan-1-one::CHEMBL1642526
SMILES CCC(=O)[C@H]1O[C@H]([C@H](O)[C@@H](O)[C@@H]1O)c1ccc(Cl)c(Cc2ncc(s2)-c2ccco2)c1
InChI Key InChIKey=YJRGLITVAGQYEQ-LXHROKJGSA-N
Data  1 IC50
  Tab Delimited (TSV)   2D SDfile   Computed 3D by Vconf -m prep SDfile
Find this compound or compounds like it in BindingDB:
Activity Spreadsheet -- Enzyme Inhibition Constant Data from BindingDB
Found 1 hit for monomerid = 50333622
TargetSodium/glucose cotransporter 2(Homo sapiens (Human))
Green Cross
Curated by ChEMBL
LigandPNGBDBM50333622(1-((2S,3S,4R,5R,6S)-6-(4-chloro-3-((5-(furan-2-yl)...)
Affinity DataIC50:  110nM. Assay description: Inhibition of human SGLT2 expressed in CHO cells assessed as inhibition of [14C]alpha-methyl-D-glucopyranoside uptake after 2 hrs by liquid scintilla...
In DepthDetails ArticlePubMed