BDBM50333629 (2S,3R,4R,5S,6R)-2-(4-chloro-3-((5-(furan-2-yl)thiazol-2-yl)methyl)phenyl)-6-((S)-1-hydroxyethyl)tetrahydro-2H-pyran-3,4,5-triol::CHEMBL1642510
SMILES C[C@H](O)[C@H]1O[C@H]([C@H](O)[C@@H](O)[C@@H]1O)c1ccc(Cl)c(Cc2ncc(s2)-c2ccco2)c1
InChI Key InChIKey=ISWDSSLQPWZBQP-CJSHNAGXSA-N
Data  1 IC50
  Tab Delimited (TSV)   2D SDfile   Computed 3D by Vconf -m prep SDfile
Find this compound or compounds like it in BindingDB:
Activity Spreadsheet -- Enzyme Inhibition Constant Data from BindingDB
Found 1 hit for monomerid = 50333629
TargetSodium/glucose cotransporter 2(Homo sapiens (Human))
Green Cross
Curated by ChEMBL
LigandPNGBDBM50333629((2S,3R,4R,5S,6R)-2-(4-chloro-3-((5-(furan-2-yl)thi...)
Affinity DataIC50:  13.5nM. Assay description: Inhibition of human SGLT2 expressed in CHO cells assessed as inhibition of [14C]alpha-methyl-D-glucopyranoside uptake after 2 hrs by liquid scintilla...
In DepthDetails ArticlePubMed