BDBM50333905 (S)-2-(5,7-dichloro-2-(4-chlorobenzoyl)-1,2,3,4-tetrahydroisoquinoline-6-carboxamido)-3-(6-methyl-1-(methylsulfonyl)-1H-indole-3-carboxamido)propanoic acid::CHEMBL1644119
SMILES Cc1ccc2c(cn(c2c1)S(C)(=O)=O)C(=O)NC[C@H](NC(=O)c1c(Cl)cc2CN(CCc2c1Cl)C(=O)c1ccc(Cl)cc1)C(O)=O
InChI Key InChIKey=AIMBUGRSRLAWJW-DEOSSOPVSA-N
Data  2 IC50
  Tab Delimited (TSV)   2D SDfile   Computed 3D by Vconf -m prep SDfile
Find this compound or compounds like it in BindingDB:
Activity Spreadsheet -- Enzyme Inhibition Constant Data from BindingDB
Found 2 hits for monomerid = 50333905
TargetIntegrin alpha-L/beta-2(Homo sapiens (Human))
Sunesis Pharmaceuticals
Curated by ChEMBL
LigandPNGBDBM50333905((S)-2-(5,7-dichloro-2-(4-chlorobenzoyl)-1,2,3,4-te...)
Affinity DataIC50:  2.50E+4nM. Assay description: Inhibition of LFA1/ICAM1 interaction in human Hut-78 cells in presence of 10% human serum
In DepthDetails ArticlePubMed
TargetIntegrin alpha-L/beta-2(Homo sapiens (Human))
Sunesis Pharmaceuticals
Curated by ChEMBL
LigandPNGBDBM50333905((S)-2-(5,7-dichloro-2-(4-chlorobenzoyl)-1,2,3,4-te...)
Affinity DataIC50:  39nM. Assay description: Inhibition of LFA1/ICAM1 interaction in human Hut-78 cells
In DepthDetails ArticlePubMed