BDBM50334281 (E)-3-styrylaniline::CHEMBL1642686
SMILES Nc1cccc(\C=C\c2ccccc2)c1
InChI Key InChIKey=STNDIHAVRCIBCC-MDZDMXLPSA-N
Data  2 KI  2 IC50
  Tab Delimited (TSV)   2D SDfile   Computed 3D by Vconf -m prep SDfile
Find this compound or compounds like it in BindingDB:
Activity Spreadsheet -- Enzyme Inhibition Constant Data from BindingDB
Found 4 hits for monomerid = 50334281
TargetAmine oxidase [flavin-containing] B(Homo sapiens (Human))
North-West University
Curated by ChEMBL
LigandPNGBDBM50334281((E)-3-styrylaniline | CHEMBL1642686)
Affinity DataKi:  2.47E+3nM. Assay description: Inhibition of human recombinant MAOB expressed in insect cells by fluorescence assay
In DepthDetails ArticlePubMed
TargetAmine oxidase [flavin-containing] A(Homo sapiens (Human))
North-West University
Curated by ChEMBL
LigandPNGBDBM50334281((E)-3-styrylaniline | CHEMBL1642686)
Affinity DataKi:  8.01E+3nM. Assay description: Inhibition of human recombinant MAOA expressed in insect cells by fluorescence assay
In DepthDetails ArticlePubMed
TargetAmine oxidase [flavin-containing] B(Homo sapiens (Human))
North-West University
Curated by ChEMBL
LigandPNGBDBM50334281((E)-3-styrylaniline | CHEMBL1642686)
Affinity DataIC50:  5.74E+3nM. Assay description: Inhibition of human recombinant MAOB expressed in insect cells by fluorescence assay
In DepthDetails ArticlePubMed
TargetAmine oxidase [flavin-containing] A(Homo sapiens (Human))
North-West University
Curated by ChEMBL
LigandPNGBDBM50334281((E)-3-styrylaniline | CHEMBL1642686)
Affinity DataIC50:  3.04E+4nM. Assay description: Inhibition of human recombinant MAOA expressed in insect cells by fluorescence assay
In DepthDetails ArticlePubMed