BDBM50334362 4-(3-(4-isopropylphenyl)ureido)benzenesulfonamide::4-{([(4'-Isopropylphenyl)amino]carbonyl)amino}benzenesulfonamide::CHEMBL1643296
SMILES CC(C)c1ccc(NC(=O)Nc2ccc(cc2)S(N)(=O)=O)cc1
InChI Key InChIKey=LQPSERXJEQNKFO-UHFFFAOYSA-N
Data  7 KI
  Tab Delimited (TSV)   2D SDfile   Computed 3D by Vconf -m prep SDfile
Find this compound or compounds like it in BindingDB:
Activity Spreadsheet -- Enzyme Inhibition Constant Data from BindingDB
Found 7 hits for monomerid = 50334362
TargetCarbonic anhydrase 12(Homo sapiens (Human))
Universita` Degli Studi Di Firenze
Curated by ChEMBL
LigandPNGBDBM50334362(4-(3-(4-isopropylphenyl)ureido)benzenesulfonamide ...)
Affinity DataKi:  50nM. Assay description: Inhibition of tumor-associated human carbonic anhydrase 12 preincubated for 15 min by CO2 hydration assay
In DepthDetails ArticlePubMed
TargetCarbonic anhydrase(Mycobacterium tuberculosis)
Universit£
Curated by ChEMBL
LigandPNGBDBM50334362(4-(3-(4-isopropylphenyl)ureido)benzenesulfonamide ...)
Affinity DataKi:  58nM. Assay description: Inhibition of Mycobacterium tuberculosis recombinant beta-carbonic anhydrase Rv3273 preincubated for 15 mins by stopped-flow CO2 hydrase assay
In DepthDetails ArticlePubMed
TargetCarbonic anhydrase 9(Homo sapiens (Human))
Universita` Degli Studi Di Firenze
Curated by ChEMBL
LigandPNGBDBM50334362(4-(3-(4-isopropylphenyl)ureido)benzenesulfonamide ...)
Affinity DataKi:  541nM. Assay description: Inhibition of tumor-associated human carbonic anhydrase 9 preincubated for 15 min by CO2 hydration assay
In DepthDetails ArticlePubMed
TargetCarbonic anhydrase 1(Homo sapiens (Human))
Universita` Degli Studi Di Firenze
Curated by ChEMBL
LigandPNGBDBM50334362(4-(3-(4-isopropylphenyl)ureido)benzenesulfonamide ...)
Affinity DataKi:  4.33E+3nM. Assay description: Inhibition of human cytosolic carbonic anhydrase 1 preincubated for 15 min by CO2 hydration assay
In DepthDetails ArticlePubMed
TargetCarbonic anhydrase 2(Homo sapiens (Human))
Universita` Degli Studi Di Firenze
Curated by ChEMBL
LigandPNGBDBM50334362(4-(3-(4-isopropylphenyl)ureido)benzenesulfonamide ...)
Affinity DataKi:  5.01E+3nM. Assay description: Inhibition of human cytosolic carbonic anhydrase 2 preincubated for 15 min by CO2 hydration assay
In DepthDetails ArticlePubMed
TargetCarbonic anhydrase 2(Homo sapiens (Human))
Universita` Degli Studi Di Firenze
Curated by ChEMBL
LigandPNGBDBM50334362(4-(3-(4-isopropylphenyl)ureido)benzenesulfonamide ...)
Affinity DataKi:  5.01E+3nM. Assay description: Inhibition of human recombinant carbonic anhydrase 2 preincubated for 15 mins by stopped-flow CO2 hydrase assay
In DepthDetails ArticlePubMed
TargetBeta-carbonic anhydrase 1(Mycobacterium tuberculosis)
Universit£
Curated by ChEMBL
LigandPNGBDBM50334362(4-(3-(4-isopropylphenyl)ureido)benzenesulfonamide ...)
Affinity DataKi:  5.69E+3nM. Assay description: Inhibition of Mycobacterium tuberculosis recombinant beta-carbonic anhydrase Rv1284 preincubated for 15 mins by stopped-flow CO2 hydrase assay
In DepthDetails ArticlePubMed