BDBM50334539 (S)-4-(2-aminoethyl)-N-(2-bromophenyl)-4,5-dihydro-1H-imidazol-2-amine dihydrobromide::CHEMBL1644498
SMILES NCC[C@H]1CN=C(Nc2ccccc2Br)N1
InChI Key InChIKey=LGWDLMLWZADYHF-QMMMGPOBSA-N
Data  1 IC50
  Tab Delimited (TSV)   2D SDfile   Computed 3D by Vconf -m prep SDfile
Find this compound or compounds like it in BindingDB:
Activity Spreadsheet -- Enzyme Inhibition Constant Data from BindingDB
Found 1 hit for monomerid = 50334539
TargetNischarin(RAT)
Gdansk University Of Technology
Curated by ChEMBL
LigandPNGBDBM50334539((S)-4-(2-aminoethyl)-N-(2-bromophenyl)-4,5-dihydro...)
Affinity DataIC50:  3.70E+3nM. Assay description: Inhibition of Sprague-Dawley rat imidazoline I1 receptor
In DepthDetails ArticlePubMed