BDBM50334696 3-(4-Methoxy-benzenesulfonyl)-thiazolidine-2-carboxylic acid adamantan-2-ylamide::CHEMBL1642610
SMILES COc1ccc(cc1)S(=O)(=O)N1CCSC1C(=O)NC1C2CC3CC(C2)CC1C3
InChI Key InChIKey=PLOHHELARDKNLH-UHFFFAOYSA-N
Data  1 IC50
  Tab Delimited (TSV)   2D SDfile   Computed 3D by Vconf -m prep SDfile
Find this compound or compounds like it in BindingDB:
Activity Spreadsheet -- Enzyme Inhibition Constant Data from BindingDB
Found 1 hit for monomerid = 50334696
Target11-beta-hydroxysteroid dehydrogenase 1(Homo sapiens (Human))
Korea University
Curated by ChEMBL
LigandPNGBDBM50334696(3-(4-Methoxy-benzenesulfonyl)-thiazolidine-2-carbo...)
Affinity DataIC50:  55nM. Assay description: Inhibition of human 11beta-HSD1 expressed in CHO cells after 3 hrs by HTRF cortisol assay
In DepthDetails ArticlePubMed