BDBM50334776 CHEMBL1642907::trans-1-((2S,4R)-4-(3,4-dichlorophenyl)-1,2,3,4-tetrahydronaphthalen-2-yl)-N-methylmethanamine
SMILES CNC[C@H]1C[C@H](c2ccc(Cl)c(Cl)c2)c2ccccc2C1
InChI Key InChIKey=NDCNHLIWHOBKGK-MLGOLLRUSA-N
Data  7 IC50
  Tab Delimited (TSV)   2D SDfile   Computed 3D by Vconf -m prep SDfile
Find this compound or compounds like it in BindingDB:
Activity Spreadsheet -- Enzyme Inhibition Constant Data from BindingDB
Found 7 hits for monomerid = 50334776
TargetSodium-dependent serotonin transporter(Homo sapiens (Human))
Sepracor
Curated by ChEMBL
LigandPNGBDBM50334776(CHEMBL1642907 | trans-1-((2S,4R)-4-(3,4-dichloroph...)
Affinity DataIC50:  54nM. Assay description: Inhibition of [3H]serotonin reuptake at human SERT expressed in HEK293 cells by scintillation counting
In DepthDetails ArticlePubMed
TargetSodium-dependent noradrenaline transporter(Homo sapiens (Human))
Sepracor
Curated by ChEMBL
LigandPNGBDBM50334776(CHEMBL1642907 | trans-1-((2S,4R)-4-(3,4-dichloroph...)
Affinity DataIC50:  126nM. Assay description: Inhibition of [3H]norepinephrine reuptake at human NET expressed in MDCK cells by scintillation counting
In DepthDetails ArticlePubMed
TargetSodium-dependent dopamine transporter(Homo sapiens (Human))
Sepracor
Curated by ChEMBL
LigandPNGBDBM50334776(CHEMBL1642907 | trans-1-((2S,4R)-4-(3,4-dichloroph...)
Affinity DataIC50:  103nM. Assay description: Inhibition of [3H]dopamine reuptake at human DAT expressed in CHOK1 cells by scintillation counting
In DepthDetails ArticlePubMed
TargetCytochrome P450 2C19(Homo sapiens (Human))
Sepracor
Curated by ChEMBL
LigandPNGBDBM50334776(CHEMBL1642907 | trans-1-((2S,4R)-4-(3,4-dichloroph...)
Affinity DataIC50:  2.17E+3nM. Assay description: Inhibition of CYP2C19
In DepthDetails ArticlePubMed
TargetCytochrome P450 2D6(Homo sapiens (Human))
Sepracor
Curated by ChEMBL
LigandPNGBDBM50334776(CHEMBL1642907 | trans-1-((2S,4R)-4-(3,4-dichloroph...)
Affinity DataIC50:  917nM. Assay description: Inhibition of CYP2D6
In DepthDetails ArticlePubMed
TargetCytochrome P450 3A4(Homo sapiens (Human))
Sepracor
Curated by ChEMBL
LigandPNGBDBM50334776(CHEMBL1642907 | trans-1-((2S,4R)-4-(3,4-dichloroph...)
Affinity DataIC50: >2.50E+4nM. Assay description: Inhibition of CYP3A4
In DepthDetails ArticlePubMed
TargetCytochrome P450 2C9(Homo sapiens (Human))
Sepracor
Curated by ChEMBL
LigandPNGBDBM50334776(CHEMBL1642907 | trans-1-((2S,4R)-4-(3,4-dichloroph...)
Affinity DataIC50: >2.50E+4nM. Assay description: Inhibition of CYP2C9
In DepthDetails ArticlePubMed