BDBM50334998 3-Biphenyl-4-yl-5-methyl-4-phenyl-4H-1,2,4-triazole::CHEMBL1649949
SMILES Cc1nnc(-c2ccc(cc2)-c2ccccc2)n1-c1ccccc1
InChI Key InChIKey=LPJNRJXWXMNHIA-UHFFFAOYSA-N
Data  3 IC50
  Tab Delimited (TSV)   2D SDfile   Computed 3D by Vconf -m prep SDfile
Find this compound or compounds like it in BindingDB:
Activity Spreadsheet -- Enzyme Inhibition Constant Data from BindingDB
Found 3 hits for monomerid = 50334998
TargetVasopressin V1a receptor(Homo sapiens (Human))
Pfizer
Curated by ChEMBL
LigandPNGBDBM50334998(3-Biphenyl-4-yl-5-methyl-4-phenyl-4H-1,2,4-triazol...)
Affinity DataIC50:  200nM. Assay description: Antagonist activity at human V1A receptor expressed in CHO cells assessed as inhibition of AVP-induced intracellular calcium release after 30 seconds...
In DepthDetails ArticlePubMed
TargetSodium- and chloride-dependent glycine transporter 1(attus norvegicus (Rat))
Astellas Pharma
Curated by ChEMBL
LigandPNGBDBM50334998(3-Biphenyl-4-yl-5-methyl-4-phenyl-4H-1,2,4-triazol...)
Affinity DataIC50:  880nM. Assay description: Inhibition of [3H]glycine uptake at GlyT1 in rat C6 cells
In DepthDetails ArticlePubMed
TargetSodium- and chloride-dependent glycine transporter 2(Rattus norvegicus)
Astellas Pharma
Curated by ChEMBL
LigandPNGBDBM50334998(3-Biphenyl-4-yl-5-methyl-4-phenyl-4H-1,2,4-triazol...)
Affinity DataIC50:  1.40E+3nM. Assay description: Inhibition of [3H]glycine uptake at GlyT2 in rat C6 cells
In DepthDetails ArticlePubMed