BDBM50335009 3-Biphenyl-4-yl-4-(2-fluorophenyl)-5-methoxy-4H-1,2,4-triazole::CHEMBL1649970
SMILES COc1nnc(-c2ccc(cc2)-c2ccccc2)n1-c1ccccc1F
InChI Key InChIKey=JPAPRFILHOQFKN-UHFFFAOYSA-N
Data  2 IC50
  Tab Delimited (TSV)   2D SDfile   Computed 3D by Vconf -m prep SDfile
Find this compound or compounds like it in BindingDB:
Activity Spreadsheet -- Enzyme Inhibition Constant Data from BindingDB
Found 2 hits for monomerid = 50335009
TargetSodium- and chloride-dependent glycine transporter 1(attus norvegicus (Rat))
Astellas Pharma
Curated by ChEMBL
LigandPNGBDBM50335009(3-Biphenyl-4-yl-4-(2-fluorophenyl)-5-methoxy-4H-1,...)
Affinity DataIC50:  510nM. Assay description: Inhibition of [3H]glycine uptake at GlyT1 in rat C6 cells
In DepthDetails ArticlePubMed
TargetSodium- and chloride-dependent glycine transporter 2(Rattus norvegicus)
Astellas Pharma
Curated by ChEMBL
LigandPNGBDBM50335009(3-Biphenyl-4-yl-4-(2-fluorophenyl)-5-methoxy-4H-1,...)
Affinity DataIC50:  990nM. Assay description: Inhibition of [3H]glycine uptake at GlyT2 in rat C6 cells
In DepthDetails ArticlePubMed