BDBM50335012 3-Biphenyl-4-yl-5-methyl-4-(2-methylphenyl)-4H-1,2,4-triazole::CHEMBL1649958
SMILES Cc1nnc(-c2ccc(cc2)-c2ccccc2)n1-c1ccccc1C
InChI Key InChIKey=NAISOSWXEBSTRD-UHFFFAOYSA-N
Data  2 IC50
  Tab Delimited (TSV)   2D SDfile   Computed 3D by Vconf -m prep SDfile
Find this compound or compounds like it in BindingDB:
Activity Spreadsheet -- Enzyme Inhibition Constant Data from BindingDB
Found 2 hits for monomerid = 50335012
TargetSodium- and chloride-dependent glycine transporter 1(attus norvegicus (Rat))
Astellas Pharma
Curated by ChEMBL
LigandPNGBDBM50335012(3-Biphenyl-4-yl-5-methyl-4-(2-methylphenyl)-4H-1,2...)
Affinity DataIC50:  300nM. Assay description: Inhibition of [3H]glycine uptake at GlyT1 in rat C6 cells
In DepthDetails ArticlePubMed
TargetSodium- and chloride-dependent glycine transporter 2(Rattus norvegicus)
Astellas Pharma
Curated by ChEMBL
LigandPNGBDBM50335012(3-Biphenyl-4-yl-5-methyl-4-(2-methylphenyl)-4H-1,2...)
Affinity DataIC50:  780nM. Assay description: Inhibition of [3H]glycine uptake at GlyT2 in rat C6 cells
In DepthDetails ArticlePubMed