BDBM50335023 3-Biphenyl-4-yl-4-(2-fluorophenyl)-5-(methylsulfanyl)-4H-1,2,4-triazole::CHEMBL1649971
SMILES CSc1nnc(-c2ccc(cc2)-c2ccccc2)n1-c1ccccc1F
InChI Key InChIKey=ORLSEGKDKRDNES-UHFFFAOYSA-N
Data  1 IC50
  Tab Delimited (TSV)   2D SDfile   Computed 3D by Vconf -m prep SDfile
Find this compound or compounds like it in BindingDB:
Activity Spreadsheet -- Enzyme Inhibition Constant Data from BindingDB
Found 1 hit for monomerid = 50335023
TargetSodium- and chloride-dependent glycine transporter 1(attus norvegicus (Rat))
Astellas Pharma
Curated by ChEMBL
LigandPNGBDBM50335023(3-Biphenyl-4-yl-4-(2-fluorophenyl)-5-(methylsulfan...)
Affinity DataIC50:  1.00E+3nM. Assay description: Inhibition of [3H]glycine uptake at GlyT1 in rat C6 cells
In DepthDetails ArticlePubMed