BDBM50335141 4-Chloro-3-(4-n-propylbenzyl)-1-(beta-D-xylopyranosyl)-1H-indole::CHEMBL1650497
SMILES CCCc1ccc(Cc2cn([C@@H]3OC[C@@H](O)[C@H](O)[C@H]3O)c3cccc(Cl)c23)cc1
InChI Key InChIKey=OXAKZOLJPFEQCL-CWKRKGSWSA-N
Data  1 EC50
  Tab Delimited (TSV)   2D SDfile   Computed 3D by Vconf -m prep SDfile
Find this compound or compounds like it in BindingDB:
Activity Spreadsheet -- Enzyme Inhibition Constant Data from BindingDB
Found 1 hit for monomerid = 50335141
TargetSodium/glucose cotransporter 2(Homo sapiens (Human))
Taiwan National Health Research Institutes
Curated by ChEMBL
LigandPNGBDBM50335141(4-Chloro-3-(4-n-propylbenzyl)-1-(beta-D-xylopyrano...)
Affinity DataEC50:  1.41E+3nM. Assay description: Inhibition of human SGLT2 expressed in CHO cells assessed as sodium-dependent [14C]-alpha-methyl-D-glucopyranoside uptake after 2 hrs by liquid scint...
In DepthDetails ArticlePubMed