BDBM50335172 3-[5-(2-Trifluoromethylphenyl)-1H-benzimidazol-2-yl]-1,8-dioxa-2-aza-spiro[4.5]dec-2-ene::CHEMBL1650529
SMILES FC(F)(F)c1ccccc1-c1ccc2nc([nH]c2c1)C1=NOC2(C1)CCOCC2
InChI Key InChIKey=UWXZOZMMZUQJSW-UHFFFAOYSA-N
Data  1 IC50
  Tab Delimited (TSV)   2D SDfile   Computed 3D by Vconf -m prep SDfile
Find this compound or compounds like it in BindingDB:
Activity Spreadsheet -- Enzyme Inhibition Constant Data from BindingDB
Found 1 hit for monomerid = 50335172
TargetTransient receptor potential M8 protein(Canis lupus familiaris (Dog))
Janssen Pharmaceutica
Curated by ChEMBL
LigandPNGBDBM50335172(3-[5-(2-Trifluoromethylphenyl)-1H-benzimidazol-2-y...)
Affinity DataIC50:  6.70nM. Assay description: Antagonist activity at canine TRPM8 expressed in HEK293 cells assessed as inhibition of intracellular calcium accumulation by FLIPR assay
In DepthDetails ArticlePubMed