BDBM50335423 2-(6-(isobutylamino)-2-(pentylamino)-9H-purin-9-yl)acetic acid::CHEMBL1651663
SMILES CCCCCNc1nc(NCC(C)C)c2ncn(CC(O)=O)c2n1
InChI Key InChIKey=CKVZSXQCVRUYBG-UHFFFAOYSA-N
Data  1 IC50  1 Kd
  Tab Delimited (TSV)   2D SDfile   Computed 3D by Vconf -m prep SDfile
Find this compound or compounds like it in BindingDB:
Activity Spreadsheet -- Enzyme Inhibition Constant Data from BindingDB
Found 2 hits for monomerid = 50335423
TargetSignal transducer and activator of transcription 3(Mus musculus (mouse))
TBA
Curated by ChEMBL
LigandPNGBDBM50335423(2-(6-(isobutylamino)-2-(pentylamino)-9H-purin-9-yl...)
Affinity DataKd:  6.00E+3nM. Assay description: Binding affinity to mouse Stat3 by surface plasmon resonance assay
In DepthDetails ArticlePubMed
TargetSignal transducer and activator of transcription 3(Mus musculus (mouse))
TBA
Curated by ChEMBL
LigandPNGBDBM50335423(2-(6-(isobutylamino)-2-(pentylamino)-9H-purin-9-yl...)
Affinity DataIC50: >1.00E+5nM. Assay description: Inhibition of mouse Stat3 DNA binding activity by EMSA
In DepthDetails ArticlePubMed