BDBM50335649 (R)-2-(4-(pyrrolidin-3-ylamino)quinazolin-2-yl)phenol::CHEMBL1650099
SMILES Oc1ccccc1-c1nc(N[C@@H]2CCNC2)c2ccccc2n1
InChI Key InChIKey=XVURFLCQTYKQLW-GFCCVEGCSA-N
Data  1 IC50
  Tab Delimited (TSV)   2D SDfile   Computed 3D by Vconf -m prep SDfile
Find this compound or compounds like it in BindingDB:
Activity Spreadsheet -- Enzyme Inhibition Constant Data from BindingDB
Found 1 hit for monomerid = 50335649
TargetSerine/threonine-protein kinase Chk2(Homo sapiens (Human))
The Institute Of Cancer Research
Curated by ChEMBL
LigandPNGBDBM50335649((R)-2-(4-(pyrrolidin-3-ylamino)quinazolin-2-yl)phe...)
Affinity DataIC50:  5.10E+3nM. Assay description: Inhibition of CHK2 by DELFIA assay
In DepthDetails ArticlePubMed