BDBM50335676 (S)-2-(6-(3-hydroxypropyl)-4-(pyrrolidin-3-ylamino)quinazolin-2-yl)phenol::CHEMBL1650093
SMILES OCCCc1ccc2nc(nc(N[C@H]3CCNC3)c2c1)-c1ccccc1O
InChI Key InChIKey=MSRXZEPPHBVIHQ-HNNXBMFYSA-N
Data  2 IC50
  Tab Delimited (TSV)   2D SDfile   Computed 3D by Vconf -m prep SDfile
Find this compound or compounds like it in BindingDB:
Activity Spreadsheet -- Enzyme Inhibition Constant Data from BindingDB
Found 2 hits for monomerid = 50335676
TargetSerine/threonine-protein kinase Chk2(Homo sapiens (Human))
The Institute Of Cancer Research
Curated by ChEMBL
LigandPNGBDBM50335676((S)-2-(6-(3-hydroxypropyl)-4-(pyrrolidin-3-ylamino...)
Affinity DataIC50:  600nM. Assay description: Inhibition of CHK2 by DELFIA assay
In DepthDetails ArticlePubMed
TargetSerine/threonine-protein kinase Chk1(Homo sapiens (Human))
The Institute Of Cancer Research
Curated by ChEMBL
LigandPNGBDBM50335676((S)-2-(6-(3-hydroxypropyl)-4-(pyrrolidin-3-ylamino...)
Affinity DataIC50:  2.60E+4nM. Assay description: Inhibition of CHK1 by DELFIA assay
In DepthDetails ArticlePubMed