BDBM50335787 6-[3-(R)-Aminopiperidin-1-yl]-1-(2-bromo-5-fluorobenzyl)-3-methyl-1H-pyrimidine-2,4-dione::CHEMBL1650440
SMILES Cn1c(=O)cc(N2CCC[C@@H](N)C2)n(Cc2cc(F)ccc2Br)c1=O
InChI Key InChIKey=GZBXRROZKDWTHE-CYBMUJFWSA-N
Data  2 IC50
  Tab Delimited (TSV)   2D SDfile   Computed 3D by Vconf -m prep SDfile
Find this compound or compounds like it in BindingDB:
Activity Spreadsheet -- Enzyme Inhibition Constant Data from BindingDB
Found 2 hits for monomerid = 50335787
TargetDipeptidyl peptidase 8(Homo sapiens (Human))
Takeda California
Curated by ChEMBL
LigandPNGBDBM50335787(6-[3-(R)-Aminopiperidin-1-yl]-1-(2-bromo-5-fluorob...)
Affinity DataIC50: >1.00E+5nM. Assay description: Inhibition of human DPP8
In DepthDetails ArticlePubMed
TargetDipeptidyl peptidase 4(Homo sapiens (Human))
Takeda California
Curated by ChEMBL
LigandPNGBDBM50335787(6-[3-(R)-Aminopiperidin-1-yl]-1-(2-bromo-5-fluorob...)
Affinity DataIC50:  8nM. Assay description: Inhibition of human DPP4
In DepthDetails ArticlePubMed