BDBM50335842 (6R,12aS)6-(3,4-Dichlorophenyl)-2-tert-butyl-2,3,6,7,12,12a-hexahydropyrazino[1',2':1,6]pyrido[3,4-b]indole-1,4-dione::CHEMBL1650885
SMILES CC(C)(C)N1CC(=O)N2[C@@H](Cc3c([nH]c4ccccc34)[C@H]2c2ccc(Cl)c(Cl)c2)C1=O
InChI Key InChIKey=FAJQXZDDJBXFSQ-SIKLNZKXSA-N
Data  1 IC50
  Tab Delimited (TSV)   2D SDfile   Computed 3D by Vconf -m prep SDfile
Find this compound or compounds like it in BindingDB:
Activity Spreadsheet -- Enzyme Inhibition Constant Data from BindingDB
Found 1 hit for monomerid = 50335842
TargetcGMP-specific 3',5'-cyclic phosphodiesterase(Homo sapiens (Human))
German University In Cairo
Curated by ChEMBL
LigandPNGBDBM50335842((6R,12aS)6-(3,4-Dichlorophenyl)-2-tert-butyl-2,3,6...)
Affinity DataIC50:  1.27E+3nM. Assay description: Inhibition of human recombinant PDE5 after 30 mins by fluorescence polarization assay
In DepthDetails ArticlePubMed