BDBM50335876 3-(1-(4-(4-bromonaphthalen-1-ylamino)-4-oxobutyl)-1H-1,2,3-triazol-4-yl)-6-hydroxy-2-phenylbenzofuran-5-carboxylic acid::CHEMBL1650899
SMILES OC(=O)c1cc2c(-c3cn(CCCC(=O)Nc4ccc(Br)c5ccccc45)nn3)c(oc2cc1O)-c1ccccc1
InChI Key InChIKey=RCFXXZPHWUVKNW-UHFFFAOYSA-N
Data  1 IC50
  Tab Delimited (TSV)   2D SDfile   Computed 3D by Vconf -m prep SDfile
Find this compound or compounds like it in BindingDB:
Activity Spreadsheet -- Enzyme Inhibition Constant Data from BindingDB
Found 1 hit for monomerid = 50335876
TargetTyrosine-protein phosphatase non-receptor type 22(Homo sapiens (Human))
Sanford-Burnham Medical Research Institute
Curated by ChEMBL
LigandPNGBDBM50335876(3-(1-(4-(4-bromonaphthalen-1-ylamino)-4-oxobutyl)-...)
Affinity DataIC50:  710nM. Assay description: Inhibition of recombinant LyP assessed as hydrolysis of DiFMUP
In DepthDetails ArticlePubMed