BDBM50335892 6-hydroxy-3-(1-(4-oxo-4-(quinolin-8-ylamino)butyl)-1H-1,2,3-triazol-4-yl)-2-phenylbenzofuran-5-carboxylic acid::CHEMBL1650915
SMILES OC(=O)c1cc2c(-c3cn(CCCC(=O)Nc4cccc5cccnc45)nn3)c(oc2cc1O)-c1ccccc1
InChI Key InChIKey=VHSZXCZCCWOTGW-UHFFFAOYSA-N
Data  1 IC50
  Tab Delimited (TSV)   2D SDfile   Computed 3D by Vconf -m prep SDfile
Find this compound or compounds like it in BindingDB:
Activity Spreadsheet -- Enzyme Inhibition Constant Data from BindingDB
Found 1 hit for monomerid = 50335892
TargetTyrosine-protein phosphatase non-receptor type 22(Homo sapiens (Human))
Sanford-Burnham Medical Research Institute
Curated by ChEMBL
LigandPNGBDBM50335892(6-hydroxy-3-(1-(4-oxo-4-(quinolin-8-ylamino)butyl)...)
Affinity DataIC50:  3.22E+3nM. Assay description: Inhibition of recombinant LyP assessed as hydrolysis of DiFMUP
In DepthDetails ArticlePubMed