BDBM50335897 6-hydroxy-3-(1-(3-(naphthalen-1-ylamino)-3-oxopropyl)-1H-1,2,3-triazol-4-yl)-2-meta-tolylbenzofuran-5-carboxylic acid::CHEMBL1650919
SMILES Cc1cccc(c1)-c1oc2cc(O)c(cc2c1-c1cn(CCC(=O)Nc2cccc3ccccc23)nn1)C(O)=O
InChI Key InChIKey=VHGOBKBQZICRNB-UHFFFAOYSA-N
Data  1 IC50
  Tab Delimited (TSV)   2D SDfile   Computed 3D by Vconf -m prep SDfile
Find this compound or compounds like it in BindingDB:
Activity Spreadsheet -- Enzyme Inhibition Constant Data from BindingDB
Found 1 hit for monomerid = 50335897
TargetTyrosine-protein phosphatase non-receptor type 22(Homo sapiens (Human))
Sanford-Burnham Medical Research Institute
Curated by ChEMBL
LigandPNGBDBM50335897(6-hydroxy-3-(1-(3-(naphthalen-1-ylamino)-3-oxoprop...)
Affinity DataIC50:  5.02E+3nM. Assay description: Inhibition of recombinant LyP assessed as hydrolysis of DiFMUP
In DepthDetails ArticlePubMed