BDBM50336133 4-chloro-N-(3-methoxypropyl)-5-(4-(trifluoromethyl)phenyl)isoxazole-3-carboxamide::CHEMBL1669521
SMILES COCCCNC(=O)c1noc(c1Cl)-c1ccc(cc1)C(F)(F)F
InChI Key InChIKey=CCDQECPACULVJC-UHFFFAOYSA-N
Data  1 IC50
  Tab Delimited (TSV)   2D SDfile   Computed 3D by Vconf -m prep SDfile
Find this compound or compounds like it in BindingDB:
Activity Spreadsheet -- Enzyme Inhibition Constant Data from BindingDB
Found 1 hit for monomerid = 50336133
TargetTransient receptor potential cation channel subfamily V member 1(Homo sapiens (Human))
Merck Sharpe And Dohme
Curated by ChEMBL
LigandPNGBDBM50336133(4-chloro-N-(3-methoxypropyl)-5-(4-(trifluoromethyl...)
Affinity DataIC50:  2.21E+3nM. Assay description: Antagonist activity at human TRPV1 expressed in CHO cells assessed as inhibition of capsaicin-induced calcium influx by fluorimetric assay
In DepthDetails ArticlePubMed