BDBM50336156 4-bromo-N-cyclopentyl-5-(4-fluorophenyl)isoxazole-3-carboxamide::CHEMBL1669544
SMILES Fc1ccc(cc1)-c1onc(C(=O)NC2CCCC2)c1Br
InChI Key InChIKey=JKXZVPMYUXNSNS-UHFFFAOYSA-N
Data  1 IC50
  Tab Delimited (TSV)   2D SDfile   Computed 3D by Vconf -m prep SDfile
Find this compound or compounds like it in BindingDB:
Activity Spreadsheet -- Enzyme Inhibition Constant Data from BindingDB
Found 1 hit for monomerid = 50336156
TargetTransient receptor potential cation channel subfamily V member 1(Homo sapiens (Human))
Merck Sharpe And Dohme
Curated by ChEMBL
LigandPNGBDBM50336156(4-bromo-N-cyclopentyl-5-(4-fluorophenyl)isoxazole-...)
Affinity DataIC50:  377nM. Assay description: Antagonist activity at human TRPV1 expressed in CHO cells assessed as inhibition of capsaicin-induced calcium influx by fluorimetric assay
In DepthDetails ArticlePubMed