BDBM50336541 CHEMBL1673336::ethyl 2-(2-(3-(3,4-dichlorophenyl)ureido)thiazol-4-yl)acetate
SMILES CCOC(=O)Cc1csc(NC(=O)Nc2ccc(Cl)c(Cl)c2)n1
InChI Key InChIKey=QYEAFWVTYABBBV-UHFFFAOYSA-N
Data  1 IC50
  Tab Delimited (TSV)   2D SDfile   Computed 3D by Vconf -m prep SDfile
Find this compound or compounds like it in BindingDB:
Activity Spreadsheet -- Enzyme Inhibition Constant Data from BindingDB
Found 1 hit for monomerid = 50336541
TargetPhosphodiesterase(Trypanosoma cruzi)
University Of Georgia
Curated by ChEMBL
LigandPNGBDBM50336541(CHEMBL1673336 | ethyl 2-(2-(3-(3,4-dichlorophenyl)...)
Affinity DataIC50:  3.60E+3nM. Assay description: Inhibition of Trypanosoma cruzi Y PDEC after 30 mins
In DepthDetails ArticlePubMed