BDBM50336567 4-Cyclohexyl-1-[N-(5-methoxynaphthalen-1-yl)-2-aminoethyl]-piperazine::CHEMBL1672042
SMILES COc1cccc2c(NCCN3CCN(CC3)C3CCCCC3)cccc12
InChI Key InChIKey=VWZXLABWDKMFBY-UHFFFAOYSA-N
Data  1 KI
  Tab Delimited (TSV)   2D SDfile   Computed 3D by Vconf -m prep SDfile
Find this compound or compounds like it in BindingDB:
Activity Spreadsheet -- Enzyme Inhibition Constant Data from BindingDB
Found 1 hit for monomerid = 50336567
TargetSigma non-opioid intracellular receptor 1(Cavia porcellus (Guinea pig))
Universita` Degli Studi Di Bari Aldo Moro
Curated by ChEMBL
LigandPNGBDBM50336567(4-Cyclohexyl-1-[N-(5-methoxynaphthalen-1-yl)-2-ami...)
Affinity DataKi:  5.40nM. Assay description: Displacement of [3H]-(+)-pentazocine from sigma 1 receptor in Dunkin guinea pig brain membrane without cerebellum
In DepthDetails ArticlePubMed