BDBM50336568 (+)-(R)-4-Cyclohexyl-1-[N-(5-methoxy-1,2,3,4-tetrahydronaphthalen-1-yl)-2-aminoethyl]piperazine::CHEMBL1672034
SMILES COc1cccc2[C@@H](CCCc12)NCCN1CCN(CC1)C1CCCCC1
InChI Key InChIKey=KNLPSXLZGRXFGB-JOCHJYFZSA-N
Data  2 KI
  Tab Delimited (TSV)   2D SDfile   Computed 3D by Vconf -m prep SDfile
Find this compound or compounds like it in BindingDB:
Activity Spreadsheet -- Enzyme Inhibition Constant Data from BindingDB
Found 2 hits for monomerid = 50336568
TargetSigma non-opioid intracellular receptor 1(Cavia porcellus (Guinea pig))
Universita` Degli Studi Di Bari Aldo Moro
Curated by ChEMBL
LigandPNGBDBM50336568((+)-(R)-4-Cyclohexyl-1-[N-(5-methoxy-1,2,3,4-tetra...)
Affinity DataKi:  14nM. Assay description: Displacement of [3H]-(+)-pentazocine from sigma 1 receptor in Dunkin guinea pig brain membrane without cerebellum
In DepthDetails ArticlePubMed
TargetSigma non-opioid intracellular receptor 1(Cavia porcellus (Guinea pig))
Universita` Degli Studi Di Bari Aldo Moro
Curated by ChEMBL
LigandPNGBDBM50336568((+)-(R)-4-Cyclohexyl-1-[N-(5-methoxy-1,2,3,4-tetra...)
Affinity DataKi:  24nM. Assay description: Displacement of [3H]-(+)-pentazocine from sigma 1 receptor in Dunkin guinea pig brain membrane without cerebellum
In DepthDetails ArticlePubMed