BDBM50336569 (+/-)-1-Cyclohexyl-4-[3-(8-methoxy-3,4-dihydro-2H-chromen-4-yl)propyl]piperazine::CHEMBL1672040
SMILES COc1cccc2C(CCCN3CCN(CC3)C3CCCCC3)CCOc12
InChI Key InChIKey=OFHQJGZDDSMQBQ-UHFFFAOYSA-N
Data  1 KI
  Tab Delimited (TSV)   2D SDfile   Computed 3D by Vconf -m prep SDfile
Find this compound or compounds like it in BindingDB:
Activity Spreadsheet -- Enzyme Inhibition Constant Data from BindingDB
Found 1 hit for monomerid = 50336569
TargetSigma non-opioid intracellular receptor 1(Cavia porcellus (Guinea pig))
Universita` Degli Studi Di Bari Aldo Moro
Curated by ChEMBL
LigandPNGBDBM50336569((+/-)-1-Cyclohexyl-4-[3-(8-methoxy-3,4-dihydro-2H-...)
Affinity DataKi:  13nM. Assay description: Displacement of [3H]-(+)-pentazocine from sigma 1 receptor in Dunkin guinea pig brain membrane without cerebellum
In DepthDetails ArticlePubMed