BDBM50336742 4-[4-(2,4-Dioxothiazolidin-5-ylidenemethyl)-2-methylphenoxy]-2-trifluoromethylbenzonitrile::CHEMBL1671985
SMILES Cc1cc(C=C2SC(O)=NC2=O)ccc1Oc1ccc(C#N)c(c1)C(F)(F)F
InChI Key InChIKey=SYOCFVXSOGJJLT-UHFFFAOYSA-N
Data  1 IC50
  Tab Delimited (TSV)   2D SDfile   Computed 3D by Vconf -m prep SDfile
Find this compound or compounds like it in BindingDB:
Activity Spreadsheet -- Enzyme Inhibition Constant Data from BindingDB
Found 1 hit for monomerid = 50336742
TargetSteroid hormone receptor ERR1(Homo sapiens (Human))
Johnson & Johnson Pharmaceutical Research And Development
Curated by ChEMBL
LigandPNGBDBM50336742(4-[4-(2,4-Dioxothiazolidin-5-ylidenemethyl)-2-meth...)
Affinity DataIC50:  800nM. Assay description: Agonist activity at 6his-tagged ERRalpha LBD assessed as recruitment of GST-labeled coactivator Scr2 by TR-FRET assay
In DepthDetails ArticlePubMed