BDBM50336811 5-(Aminomethyl)-2-methyl-4-(4-methylphenyl)-6-propylpyridine-3-carboxylic Acid Dihydrochloride::CHEMBL1672118
SMILES CCCc1nc(C)c(C(O)=O)c(-c2ccc(C)cc2)c1CN
InChI Key InChIKey=HTCVHQAJCNOCNF-UHFFFAOYSA-N
Data  1 IC50
  Tab Delimited (TSV)   2D SDfile   Computed 3D by Vconf -m prep SDfile
Find this compound or compounds like it in BindingDB:
Activity Spreadsheet -- Enzyme Inhibition Constant Data from BindingDB
Found 1 hit for monomerid = 50336811
TargetDipeptidyl peptidase 4(Homo sapiens (Human))
Takeda Pharmaceutical
Curated by ChEMBL
LigandPNGBDBM50336811(5-(Aminomethyl)-2-methyl-4-(4-methylphenyl)-6-prop...)
Affinity DataIC50:  57nM. Assay description: Inhibition of DPP4 in human Caco2 cells after 60 mins
In DepthDetails ArticlePubMed