BDBM50337143 9-fluoro-2-((2-methoxy-4-(4-methylpiperazin-1-yl)phenyl)amino)-5,11-dimethyl-5H-benzo[e]pyrimido[5,4-b][1,4]diazepin-6(11H)-one::CHEMBL1673055
SMILES COc1cc(ccc1Nc1ncc2N(C)C(=O)c3ccc(F)cc3N(C)c2n1)N1CCN(C)CC1
InChI Key InChIKey=VOMMOJXYDRSJDB-UHFFFAOYSA-N
Data  1 IC50
  Tab Delimited (TSV)   2D SDfile   Computed 3D by Vconf -m prep SDfile
Find this compound or compounds like it in BindingDB:
Activity Spreadsheet -- Enzyme Inhibition Constant Data from BindingDB
Found 1 hit for monomerid = 50337143
TargetMitogen-activated protein kinase 7(Homo sapiens (Human))
TBA
Curated by ChEMBL
LigandPNGBDBM50337143(9-fluoro-2-((2-methoxy-4-(4-methylpiperazin-1-yl)p...)
Affinity DataIC50:  1.32E+3nM. Assay description: Inhibition of EGF-induced BMK1 autophosphorylation in human HeLa cells by SDS-PAGE analysis
In DepthDetails ArticlePubMed