BDBM50337433 CHEMBL1681797::rac-2-((4-acetamido-4-phenylpiperidin-1-yl)methyl)-1-(3,4-dichlorophenyl)-N-methyl-N-(4-methylbenzyl)cyclopropanecarboxamide
SMILES CN(Cc1ccc(C)cc1)C(=O)C1(CC1CN1CCC(CC1)(NC(C)=O)c1ccccc1)c1ccc(Cl)c(Cl)c1
InChI Key InChIKey=XQZPJUKBNPBJEI-UHFFFAOYSA-N
Data  1 KI
  Tab Delimited (TSV)   2D SDfile   Computed 3D by Vconf -m prep SDfile
Find this compound or compounds like it in BindingDB:
Activity Spreadsheet -- Enzyme Inhibition Constant Data from BindingDB
Found 1 hit for monomerid = 50337433
TargetNeuromedin-K receptor(Homo sapiens (Human))
H. Lundbeck
Curated by ChEMBL
LigandPNGBDBM50337433(CHEMBL1681797 | rac-2-((4-acetamido-4-phenylpiperi...)
Affinity DataKi:  7.5nM. Assay description: Displacement of [3H]Lu AE93103 from human NK3 receptor expressed in BHK cells
In DepthDetails ArticlePubMed