BDBM50337766 3-((R)-3-amino-4-(2,4,5-trifluorophenyl)butanoyl)-N-(4-hydroxybenzyl)thiazolidine-2-carboxamide hydrochloride::CHEMBL1683485
SMILES N[C@@H](CC(=O)N1CCSC1C(=O)NCc1ccc(O)cc1)Cc1cc(F)c(F)cc1F
InChI Key InChIKey=LLVZNJQSRNBDJA-CKAQCJTGSA-N
Data  1 IC50
  Tab Delimited (TSV)   2D SDfile   Computed 3D by Vconf -m prep SDfile
Find this compound or compounds like it in BindingDB:
Activity Spreadsheet -- Enzyme Inhibition Constant Data from BindingDB
Found 1 hit for monomerid = 50337766
TargetDipeptidyl peptidase 4(Homo sapiens (Human))
Korea Research Institute Of Chemical Technology
Curated by ChEMBL
LigandPNGBDBM50337766(3-((R)-3-amino-4-(2,4,5-trifluorophenyl)butanoyl)-...)
Affinity DataIC50:  328nM. Assay description: Inhibition of human recombinant DPP4 after 60 mins by fluorescence plate reader
In DepthDetails ArticlePubMed