BDBM50337768 CHEMBL1683487::ethyl 2-(4-((3-((R)-3-amino-4-(2,4,5-trifluorophenyl)butanoyl)thiazolidine-2-carboxamido)methyl)phenoxy)acetate hydrochloride
SMILES CCOC(=O)COc1ccc(CNC(=O)C2SCCN2C(=O)C[C@H](N)Cc2cc(F)c(F)cc2F)cc1
InChI Key InChIKey=TYYMLFVDYGZKHF-SMFUYQKNSA-N
Data  1 IC50
  Tab Delimited (TSV)   2D SDfile   Computed 3D by Vconf -m prep SDfile
Find this compound or compounds like it in BindingDB:
Activity Spreadsheet -- Enzyme Inhibition Constant Data from BindingDB
Found 1 hit for monomerid = 50337768
TargetDipeptidyl peptidase 4(Homo sapiens (Human))
Korea Research Institute Of Chemical Technology
Curated by ChEMBL
LigandPNGBDBM50337768(CHEMBL1683487 | ethyl 2-(4-((3-((R)-3-amino-4-(2,4...)
Affinity DataIC50:  41nM. Assay description: Inhibition of human recombinant DPP4 after 60 mins by fluorescence plate reader
In DepthDetails ArticlePubMed