BDBM50337769 2-(4-((3-((R)-3-amino-4-(2,4,5-trifluorophenyl)butanoyl)thiazolidine-2-carboxamido)methyl)phenoxy)acetic acid hydrochloride::CHEMBL1683488
SMILES N[C@@H](CC(=O)N1CCSC1C(=O)NCc1ccc(OCC(O)=O)cc1)Cc1cc(F)c(F)cc1F
InChI Key InChIKey=XHRDYOUGUQJNRZ-NKTHEXPSSA-N
Data  1 IC50
  Tab Delimited (TSV)   2D SDfile   Computed 3D by Vconf -m prep SDfile
Find this compound or compounds like it in BindingDB:
Activity Spreadsheet -- Enzyme Inhibition Constant Data from BindingDB
Found 1 hit for monomerid = 50337769
TargetDipeptidyl peptidase 4(Homo sapiens (Human))
Korea Research Institute Of Chemical Technology
Curated by ChEMBL
LigandPNGBDBM50337769(2-(4-((3-((R)-3-amino-4-(2,4,5-trifluorophenyl)but...)
Affinity DataIC50:  51nM. Assay description: Inhibition of human recombinant DPP4 after 60 mins by fluorescence plate reader
In DepthDetails ArticlePubMed